frame

Howdy, Stranger!

It looks like you're new here. If you want to get involved, click one of these buttons!

Sign In

Howdy, Stranger!

It looks like you're new here. If you want to get involved, click one of these buttons!

error during installation NC SDK on ubuntu 16.04

[100%] Building CXX object python/CMakeFiles/pycaffe.dir/caffe/_caffe.cpp.o
c++: internal compiler error: Killed (program cc1plus)
Please submit a full bug report,
with preprocessed source if appropriate.
See <file:///usr/share/doc/gcc-5/README.Bugs> for instructions.
python/CMakeFiles/pycaffe.dir/build.make:62: recipe for target 'python/CMakeFiles/pycaffe.dir/caffe/_caffe.cpp.o' failed
make[3]: *** [python/CMakeFiles/pycaffe.dir/caffe/_caffe.cpp.o] Error 4
make[3]: Leaving directory '/opt/movidius/ssd-caffe/build'
CMakeFiles/Makefile2:1245: recipe for target 'python/CMakeFiles/pycaffe.dir/all' failed
make[2]: *** [python/CMakeFiles/pycaffe.dir/all] Error 2
make[2]: Leaving directory '/opt/movidius/ssd-caffe/build'
Makefile:127: recipe for target 'all' failed
make[1]: *** [all] Error 2
make[1]: Leaving directory '/opt/movidius/ssd-caffe/build'
Installation failed. Error on line 498

any ideas what's the problem?

Comments

Sign In or Register to comment.