frame

Howdy, Stranger!

It looks like you're new here. If you want to get involved, click one of these buttons!

Sign In

Howdy, Stranger!

It looks like you're new here. If you want to get involved, click one of these buttons!

Alert: Beginning Tuesday, June 25th, we will be freezing this site and migrating the content and forums to our new home at https://forums.intel.com/s/topic/0TO0P000000PqZDWA0/intel-neural-compute-sticks. Check it out now!

Caffe make error in raspbian stretch.

I am following this to install SDK https://developer.movidius.com/start
But after some time i am getting this error ,

_[ 75%] Built target caffe
make[3]: Entering directory '/opt/movidius/bvlc-caffe/build'
Scanning dependencies of target upgrade_solver_proto_text
make[3]: Leaving directory '/opt/movidius/bvlc-caffe/build'
make[3]: Entering directory '/opt/movidius/bvlc-caffe/build'
[ 75%] Building CXX object tools/CMakeFiles/upgrade_solver_proto_text.dir/upgrade_solver_proto_text.cpp.o
[ 76%] Linking CXX executable upgrade_solver_proto_text
../lib/libcaffe.so.1.0.0: undefined reference to

cv::String::allocate(unsigned int)'
../lib/libcaffe.so.1.0.0: undefined reference to
cv::imread(cv::String const&, int)'
../lib/libcaffe.so.1.0.0: undefined reference to
cv::String::deallocate()'
../lib/libcaffe.so.1.0.0: undefined reference to
cv::imencode(cv::String const&, cv::_InputArray const&, std::vector >&, std::vector<int, std::allocator > const&)'
collect2: error: ld returned 1 exit status
tools/CMakeFiles/upgrade_solver_proto_text.dir/build.make:128: recipe for target 'tools/upgrade_solver_proto_text' failed
make[3]: *** [tools/upgrade_solver_proto_text] Error 1
make[3]: Leaving directory '/opt/movidius/bvlc-caffe/build'
CMakeFiles/Makefile2:467: recipe for target 'tools/CMakeFiles/upgrade_solver_proto_text.dir/all' failed
make[2]: *** [tools/CMakeFiles/upgrade_solver_proto_text.dir/all] Error 2
make[2]: Leaving directory '/opt/movidius/bvlc-caffe/build'
Makefile:127: recipe for target 'all' failed
make[1]: *** [all] Error 2
make[1]: Leaving directory '/opt/movidius/bvlc-caffe/build'
Installing caffe...
make[1]: Entering directory '/opt/movidius/bvlc-caffe/build'
make[2]: Entering directory '/opt/movidius/bvlc-caffe/build'
make[3]: Entering directory '/opt/movidius/bvlc-caffe/build'
make[3]: Leaving directory '/opt/movidius/bvlc-caffe/build'
[ 1%] Built target proto
make[3]: Entering directory '/opt/movidius/bvlc-caffe/build'
make[3]: Leaving directory '/opt/movidius/bvlc-caffe/build'
[ 75%] Built target caffe
make[3]: Entering directory '/opt/movidius/bvlc-caffe/build'
make[3]: Leaving directory '/opt/movidius/bvlc-caffe/build'
make[3]: Entering directory '/opt/movidius/bvlc-caffe/build'
[ 76%] Linking CXX executable upgrade_solver_proto_text
../lib/libcaffe.so.1.0.0: undefined reference to
cv::String::allocate(unsigned int)'
../lib/libcaffe.so.1.0.0: undefined reference to
cv::imread(cv::String const&, int)'
../lib/libcaffe.so.1.0.0: undefined reference to
cv::String::deallocate()'
../lib/libcaffe.so.1.0.0: undefined reference to
cv::imencode(cv::String const&, cv::_InputArray const&, std::vector >&, std::vector<int, std::allocator > const&)'
collect2: error: ld returned 1 exit status
tools/CMakeFiles/upgrade_solver_proto_text.dir/build.make:128: recipe for target 'tools/upgrade_solver_proto_text' failed
make[3]: *** [tools/upgrade_solver_proto_text] Error 1
make[3]: Leaving directory '/opt/movidius/bvlc-caffe/build'
CMakeFiles/Makefile2:467: recipe for target 'tools/CMakeFiles/upgrade_solver_proto_text.dir/all' failed
make[2]: *** [tools/CMakeFiles/upgrade_solver_proto_text.dir/all] Error 2
make[2]: Leaving directory '/opt/movidius/bvlc-caffe/build'
Makefile:127: recipe for target 'all' failed
make[1]: *** [all] Error 2
make[1]: Leaving directory '/opt/movidius/bvlc-caffe/build'
Installation failed. Error on line 522

_

i have downloaded Raspbian stretch image from here https://raspberrypi.org/downloads/raspbian/

My raspbian strectch config is like that:

Architecture: armv7l
Byte Order: Little Endian
CPU(s): 4
On-line CPU(s) list: 0-3
Thread(s) per core: 1
Core(s) per socket: 4
Socket(s): 1
Model: 4
Model name: ARMv7 Processor rev 4 (v7l)
CPU max MHz: 1200.0000
CPU min MHz: 600.0000
BogoMIPS: 38.40
Flags: half thumb fastmult vfp edsp neon vfpv3 tls vfpv4 idiva idivt vfpd32 lpae evtstrm crc32

will you please help me where i am doing wrong.
@AshwinVijayakumar @Tome_at_Intel @ramana.rachakonda

Comments

Sign In or Register to comment.