frame

Howdy, Stranger!

It looks like you're new here. If you want to get involved, click one of these buttons!

Sign In

Howdy, Stranger!

It looks like you're new here. If you want to get involved, click one of these buttons!

install ncsdk1.x on ubuntu1604 which is a docker image

Hi,
I need install ncsdk1.12 on ubuntu1604 which is a docker image.But I encountering this error when building.

collect2: error: ld returned 1 exit status
tools/CMakeFiles/upgrade_solver_proto_text.dir/build.make:129: recipe for target 'tools/upgrade_solver_proto_text' failed
make[2]: *** [tools/upgrade_solver_proto_text] Error 1
CMakeFiles/Makefile2:479: recipe for target 'tools/CMakeFiles/upgrade_solver_proto_text.dir/all' failed
make[1]: *** [tools/CMakeFiles/upgrade_solver_proto_text.dir/all] Error 2

Your help will be greatly appreciated!

Thanks

Comments

Sign In or Register to comment.