frame

Howdy, Stranger!

It looks like you're new here. If you want to get involved, click one of these buttons!

Sign In

Howdy, Stranger!

It looks like you're new here. If you want to get involved, click one of these buttons!

NCSAPPZOO make fails on gendernet - RPI 3B+, NCS2

I can make most of the apps if I do them individually, but after cloning ncsappzoo (ncsdk2 branch) - and running make - it bombs out

    Error:
    2019-01-11 15:32:11 (444 KB/s) - ‘lbpcascade_frontalface_improved.xml’ saved [54039/54039]

    cp gendernet.graph gender_graph/graph;
    cp agenet.graph age_graph/graph;
    ./compile.sh;
    no videoio library
    /usr/bin/ld: /tmp/ccPjFXxU.o: undefined reference to symbol '_ZN2cv12VideoCapture3setEid'
    //usr/local/lib/libopencv_videoio.so.4.0: error adding symbols: DSO missing from command line
    collect2: error: ld returned 1 exit status
    Makefile:19: recipe for target 'gender_age_lbp' failed
    make[2]: *** [gender_age_lbp] Error 1
    make[2]: Leaving directory '/home/pi/movidius/ncappzoo/apps/gender_age_lbp'
    Makefile:12: recipe for target 'gender_age_lbp/.' failed
    make[1]: *** [gender_age_lbp/.] Error 2
    make[1]: Leaving directory '/home/pi/movidius/ncappzoo/apps'
    Makefile:12: recipe for target 'apps/.' failed
    make: *** [apps/.] Error 2
    pi@picam:~/movidius/ncappzoo $ 

Any suggestions to resolve would be appreciated.

Comments

Sign In or Register to comment.